{"text_format":"1","workbook":"xlsx","n_sheets":19,"sheets":["Getting Started","As-Is Owner Goals","As-Is Pro Forma Statement","As-Is Before-Tax Cash Flow","Alt Owner Goals","Alt Pro Forma Statement","Alt Before-Tax Cash Flow","Alt Office Comp Grid","Alt Residential Comp Grid 1","Alt Residential Comp Grid 2","Alt Retail Comp Grid 1 ","EF Cash Flow","Alt Retail Comp Grid 2","As-Is BTCF T Bars","As-Is Loan Amortization","Alt BTCF T Bars","Alt Loan Amortization","Calculator","Blank Sheet for Calculations"],"not_rendered":{"charts":0,"images":1,"macros":1,"external_links":0,"defined_names":20,"comments":3,"pivot_tables":0},"unopened":[],"bounds":{"document_bytes":16777216,"sheet_cells":100000,"rows_first":2000,"rows_last":500,"rows_between":2000,"halvings":0,"cell_chars":16384,"cell_head_chars":4096},"cells_cut":0,"cells_raw":0,"read":"whole","date_system":"1900"}

{"sheet":"Getting Started","index":0,"n_rows":19,"n_cols":1,"rows_kept":19,"cut":false,"hidden":false,"merged":[]}
["                                          MPSA Practice Spreadsheet  20190101                  "]
["                                          Use for activities and practice on Days 1-2 of the Capstone Track       "]
[]
["All data should be entered in the yellow highlighted cells only."]
[]
["Overview of Tabs"]
["As Is Cash Flow Analysis: Use these sheets to complete an As Is cash flow analysis."]
["Alternative Cash Flow Analysis: Use sheets to complete an Alternative cash flow analysis."]
{"$rows_left_out":12}
{"sheet":"As-Is Owner Goals","index":1,"n_rows":32,"n_cols":65,"rows_kept":32,"cut":false,"hidden":false,"merged":[[11,0,11,1],[10,0,10,1],[6,0,6,1],[9,0,9,1],[14,5,14,6],[13,5,13,7],[21,5,25,5],[15,0,15,1],[12,0,12,1],[13,0,13,1],[19,5,19,6],[23,0,23,1],[17,5,17,6],[18,5,18,6],[16,5,16,6],[3,0,3,1],[1,4,1,5],[2,0,2,2],[2,5,2,7],[3,3,9,3],[5,0,5,1],[4,0,4,1],[6,5,6,6]]}
["As Is Owner Goals"]
["Enter data in the yellow cells only."]
["ANALYSIS VARIABLES",null,null,null,null,"INITIAL LOAN ANALYSIS"]
["Loan Amount ($)",null,null,null,null,"Annual Debt Service (ADS)",null,{"$f":"IF(C5=0,\"-\",IF(C7=0,(C4*C5),IF(C4=0,\"-\",IF(C14=\"Monthly\",(PMT(C5/12,C7*12,B22)*12),(PMT(((1+C5/2)^(2/12))-1,C7*12,B22)*12)))))","v":"-"}]
["Loan Interest Rate (%)"]
["Loan Pre-paid points (%)             (EFI%)"]
["Loan Amortization Period (years)"]
["Loan Term/Balloon (years)","(EFI%)"]
{"$rows_left_out":25}
{"sheet":"As-Is Pro Forma Statement","index":2,"n_rows":50,"n_cols":8,"rows_kept":50,"cut":false,"hidden":false,"merged":[[21,0,21,7],[16,0,16,7],[15,0,15,7],[1,0,1,1]]}
["As Is Pro Forma Statement"]
["Enter data in the yellow cells only.",null," "]
["Income","Annual"]
[null,"Increase","Year 1","Year 2","Year 3","Year 4","Year 5","Year 6"]
["Gross Potential Income (GPI)",0,0,{"$f":"+C5*(1+$B$5)","v":0},{"$f":"+D5*(1+$B$5)","v":0},{"$f":"+E5*(1+$B$5)","v":0},{"$f":"+F5*(1+$B$5)","v":0},{"$f":"+G5*(1+$B$5)","v":0}]
["- Loss to Lease",0,0,{"$f":"+C6*(1+$B$6)","v":0},{"$f":"+D6*(1+$B$6)","v":0},{"$f":"+E6*(1+$B$6)","v":0},{"$f":"+F6*(1+$B$6)","v":0},{"$f":"+G6*(1+$B$6)","v":0}]
["- Vacancy and Collection Loss",0,0,{"$f":"+C7*(1+$B$7)","v":0},{"$f":"+D7*(1+$B$7)","v":0},{"$f":"+E7*(1+$B$7)","v":0},{"$f":"+F7*(1+$B$7)","v":0},{"$f":"+G7*(1+$B$7)","v":0}]
["= Net Rent Revenue",null,{"$f":"SUM(C5,-C6,-C7)","v":0},0,0,0,0,0]
{"$rows_left_out":43}
{"sheet":"As-Is Before-Tax Cash Flow","index":3,"n_rows":34,"n_cols":10,"rows_kept":34,"cut":false,"hidden":false,"merged":[[0,0,0,2],[3,0,3,1],[4,0,4,1],[2,0,2,2],[2,4,2,9],[1,0,1,5],[11,4,11,9],[5,0,5,1],[6,0,6,1],[7,0,7,1],[9,0,9,1],[8,0,8,1],[27,4,27,7],[18,4,18,5],[12,0,12,1],[20,0,20,1],[12,4,12,9]]}
["As Is Before-Tax Cash Flow Analysis"]
["This tab automatically calculates figures based on data entered in other tabs."]
["ANALYSIS VARIABLES",null,null,null,"BEFORE-TAX CASH FLOW (BTCF)"]
["Loan Amount",null,{"$f":"+'As-Is Owner Goals'!C4","v":0},null,null,"Year 1","Year 2","Year 3","Year 4","Year 5"]
["Loan Interest Rate",null,{"$f":"+'As-Is Owner Goals'!C5","v":0},null,"NOI",{"$f":"+'As-Is Pro Forma Statement'!C50","v":0},{"$f":"+'As-Is Pro Forma Statement'!D50","v":0},{"$f":"+'As-Is Pro Forma Statement'!E50","v":0},{"$f":"+'As-Is Pro Forma Statement'!F50","v":0},{"$f":"+'As-Is Pro Forma Statement'!G50","v":0}]
["Loan Amortization Period (years)",null,{"$f":"+'As-Is Owner Goals'!C7","v":0},null,"- Loan Principal",{"$f":"-'As-Is Loan Amortization'!C22","v":9.9501331045201979E-10},{"$f":"-'As-Is Loan Amortization'!C35","v":9.9502326063072934E-10},{"$f":"-'As-Is Loan Amortization'!C48","v":9.9503321090894086E-10},{"$f":"-SUM('As-Is Loan Amortization'!C61)","v":9.9504316128665579E-10},{"$f":"-'As-Is Loan Amortization'!C74","v":9.9505311176387497E-10}]
["Analysis Begin Month",null,{"$f":"+'As-Is Owner Goals'!C10","v":0},null,"- Loan Interest",{"$f":"-'As-Is Loan Amortization'!D22","v":9.9954395305612881E-12},{"$f":"-'As-Is Loan Amortization'!D35","v":9.9854893518518632E-12},{"$f":"-'As-Is Loan Amortization'!D48","v":9.9755390736401975E-12},{"$f":"-'As-Is Loan Amortization'!D61","v":9.9655886959252924E-12},{"$f":"-'As-Is Loan Amortization'!D74","v":9.9556382187061527E-12}]
["Owner Required Return",null,{"$f":"+'As-Is Owner Goals'!C11","v":0}]
{"$rows_left_out":27}
{"sheet":"Alt Owner Goals","index":4,"n_rows":32,"n_cols":65,"rows_kept":32,"cut":false,"hidden":false,"merged":[[3,0,3,1],[1,4,1,5],[2,0,2,2],[2,5,2,7],[3,3,9,3],[5,0,5,1],[4,0,4,1],[6,5,6,6],[6,0,6,1],[9,0,9,1],[11,0,11,1],[10,0,10,1],[23,0,23,1],[21,5,25,5],[15,0,15,1],[12,0,12,1],[13,0,13,1],[19,5,19,6],[14,5,14,6],[16,5,16,6],[17,5,17,6],[18,5,18,6],[13,5,13,7]]}
["Alternative Owner Goals and Objectives"]
["Enter data in the yellow cells only."]
["ANALYSIS VARIABLES",null,null,null,null,"INITIAL LOAN ANALYSIS"]
["Loan Amount ($)",null,null,null,null,"Annual Debt Service (ADS)",null,{"$f":"IF(C5=0,\"-\",IF(C7=0,(C4*C5),IF(C4=0,\"-\",IF(C14=\"Monthly\",(PMT(C5/12,C7*12,B22)*12),(PMT(((1+C5/2)^(2/12))-1,C7*12,B22)*12)))))","v":"-"}]
["Loan Interest Rate (%)"]
["Loan Pre-paid points (%)             (EFI%)"]
["Loan Amortization Period (years)"]
["Loan Term/Balloon (years)","(EFI%)"]
{"$rows_left_out":25}
{"sheet":"Alt Pro Forma Statement","index":5,"n_rows":50,"n_cols":8,"rows_kept":50,"cut":false,"hidden":false,"merged":[[21,0,21,7],[16,0,16,7],[15,0,15,7],[1,0,1,1]]}
["Alternative Pro Forma Statement"]
["Enter data in the yellow cells only.",null," "]
["Income","Annual"]
[null,"Increase","Year 1","Year 2","Year 3","Year 4","Year 5","Year 6"]
["Gross Potential Income (GPI)",0,0,{"$f":"+C5*(1+$B$5)","v":0},{"$f":"+D5*(1+$B$5)","v":0},{"$f":"+E5*(1+$B$5)","v":0},{"$f":"+F5*(1+$B$5)","v":0},{"$f":"+G5*(1+$B$5)","v":0}]
["- Loss to Lease",0,0,{"$f":"+C6*(1+$B$6)","v":0},{"$f":"+D6*(1+$B$6)","v":0},{"$f":"+E6*(1+$B$6)","v":0},{"$f":"+F6*(1+$B$6)","v":0},{"$f":"+G6*(1+$B$6)","v":0}]
["- Vacancy and Collection Loss",0,0,{"$f":"+C7*(1+$B$7)","v":0},{"$f":"+D7*(1+$B$7)","v":0},{"$f":"+E7*(1+$B$7)","v":0},{"$f":"+F7*(1+$B$7)","v":0},{"$f":"+G7*(1+$B$7)","v":0}]
["= Net Rent Revenue",null,{"$f":"SUM(C5,-C6,-C7)","v":0},0,0,0,0,0]
{"$rows_left_out":43}
{"sheet":"Alt Before-Tax Cash Flow","index":6,"n_rows":34,"n_cols":10,"rows_kept":34,"cut":false,"hidden":false,"merged":[[1,0,1,5],[11,4,11,9],[5,0,5,1],[6,0,6,1],[7,0,7,1],[9,0,9,1],[8,0,8,1],[3,0,3,1],[4,0,4,1],[2,0,2,2],[2,4,2,9],[27,4,27,7],[18,4,18,5],[12,0,12,1],[20,0,20,1],[12,4,12,9]]}
["Alternative Before-Tax Cash Flow Analysis"]
["This tab automatically calculates figures based on data entered in other tabs."]
["ANALYSIS VARIABLES",null,null,null,"BEFORE-TAX CASH FLOW (BTCF)"]
["Loan Amount",null,{"$f":"+'Alt Owner Goals'!C4","v":0},null,null,"Year 1","Year 2","Year 3","Year 4","Year 5"]
["Loan Interest Rate",null,{"$f":"+'Alt Owner Goals'!C5","v":0},null,"NOI",{"$f":"+'Alt Pro Forma Statement'!C50","v":0},{"$f":"+'Alt Pro Forma Statement'!D50","v":0},{"$f":"+'Alt Pro Forma Statement'!E50","v":0},{"$f":"+'Alt Pro Forma Statement'!F50","v":0},{"$f":"+'Alt Pro Forma Statement'!G50","v":0}]
["Loan Amortization Period (years)",null,{"$f":"+'Alt Owner Goals'!C7","v":0},null,"- Loan Principal",{"$f":"-'Alt Loan Amortization'!C22","v":9.9501331045201979E-10},{"$f":"-'Alt Loan Amortization'!C35","v":9.9502326063072934E-10},{"$f":"-'Alt Loan Amortization'!C48","v":9.9503321090894086E-10},{"$f":"-'Alt Loan Amortization'!C61","v":9.9504316128665579E-10},{"$f":"-'Alt Loan Amortization'!C74","v":9.9505311176387497E-10}]
["Analysis Begin Month",null,{"$f":"+'Alt Owner Goals'!C10","v":0},null,"- Loan Interest",{"$f":"-'Alt Loan Amortization'!D22","v":9.9954395305612881E-12},{"$f":"-'Alt Loan Amortization'!D35","v":9.9854893518518632E-12},{"$f":"-'Alt Loan Amortization'!D48","v":9.9755390736401975E-12},{"$f":"-'Alt Loan Amortization'!D61","v":9.9655886959252924E-12},{"$f":"-'Alt Loan Amortization'!D74","v":9.9556382187061527E-12}]
["Owner Required Return",null,{"$f":"+'Alt Owner Goals'!C11","v":0}]
{"$rows_left_out":27}
{"sheet":"Alt Office Comp Grid","index":7,"n_rows":726,"n_cols":8,"rows_kept":726,"cut":false,"hidden":false,"merged":[[44,0,44,5],[42,2,42,3],[42,4,42,5],[42,6,42,7],[43,2,43,3],[43,4,43,5],[43,6,43,7],[41,2,41,3],[41,4,41,5],[41,6,41,7],[7,2,7,3],[7,4,7,5],[7,6,7,7],[8,2,8,3],[8,4,8,5],[8,6,8,7],[9,2,9,3],[9,4,9,5],[9,6,9,7],[10,0,10,7],[40,0,40,7],[5,2,5,3],[5,4,5,5],[5,6,5,7],[6,2,6,3],[6,4,6,5],[6,6,6,7],[4,2,4,3],[4,4,4,5],[4,6,4,7],[0,0,0,1],[1,0,1,3],[3,2,3,3],[3,4,3,5],[3,6,3,7]]}
["Office Comparison Grid"]
["Enter data in the yellow cells only."]
[]
[null,"Subject","Comparable 1",null,"Comparable 2",null,"Comparable 3"]
["Property Name"]
["Base rental rate"]
["- Concessions"]
["+ Exp. pass-through"]
{"$rows_left_out":719}
{"sheet":"Alt Residential Comp Grid 1","index":8,"n_rows":41,"n_cols":8,"rows_kept":41,"cut":false,"hidden":false,"merged":[[38,2,38,3],[38,4,38,5],[38,6,38,7],[39,2,39,3],[39,4,39,5],[39,6,39,7],[37,2,37,3],[37,4,37,5],[37,6,37,7],[9,2,9,3],[9,4,9,5],[9,6,9,7],[10,2,10,3],[10,4,10,5],[10,6,10,7],[11,0,11,7],[35,0,35,7],[36,2,36,3],[36,4,36,5],[36,6,36,7],[7,2,7,3],[7,4,7,5],[7,6,7,7],[8,2,8,3],[8,4,8,5],[8,6,8,7],[5,2,5,3],[5,4,5,5],[5,6,5,7],[6,2,6,3],[6,4,6,5],[6,6,6,7],[4,2,4,3],[4,4,4,5],[4,6,4,7],[0,0,0,2],[1,0,1,3],[3,2,3,3],[3,4,3,5],[3,6,3,7]]}
["Residential Comparison Grid"]
["Enter data in the yellow cells only."]
[]
[null,"Subject","Comparable 1",null,"Comparable 2",null,"Comparable 3"]
["Property Name"]
["Base rental rate"]
["- Concessions"]
["+ Other income"]
{"$rows_left_out":34}
{"sheet":"Alt Residential Comp Grid 2","index":9,"n_rows":41,"n_cols":8,"rows_kept":41,"cut":false,"hidden":false,"merged":[[38,2,38,3],[38,4,38,5],[38,6,38,7],[39,2,39,3],[39,4,39,5],[39,6,39,7],[37,2,37,3],[37,4,37,5],[37,6,37,7],[9,2,9,3],[9,4,9,5],[9,6,9,7],[10,2,10,3],[10,4,10,5],[10,6,10,7],[11,0,11,7],[35,0,35,7],[36,2,36,3],[36,4,36,5],[36,6,36,7],[7,2,7,3],[7,4,7,5],[7,6,7,7],[8,2,8,3],[8,4,8,5],[8,6,8,7],[5,2,5,3],[5,4,5,5],[5,6,5,7],[6,2,6,3],[6,4,6,5],[6,6,6,7],[4,2,4,3],[4,4,4,5],[4,6,4,7],[0,0,0,2],[1,0,1,3],[3,2,3,3],[3,4,3,5],[3,6,3,7]]}
["Residential Comparison Grid"]
["Enter data in the yellow cells only."]
[]
[null,"Subject","Comparable 1",null,"Comparable 2",null,"Comparable 3"]
["Property Name"]
["Base rental rate"]
["- Concessions"]
["+ Other income"]
{"$rows_left_out":34}
{"sheet":"Alt Retail Comp Grid 1 ","index":10,"n_rows":38,"n_cols":8,"rows_kept":38,"cut":false,"hidden":false,"merged":[[37,0,37,5],[35,2,35,3],[35,4,35,5],[35,6,35,7],[36,2,36,3],[36,4,36,5],[36,6,36,7],[34,2,34,3],[34,4,34,5],[34,6,34,7],[7,2,7,3],[7,4,7,5],[7,6,7,7],[8,2,8,3],[8,4,8,5],[8,6,8,7],[9,2,9,3],[9,4,9,5],[9,6,9,7],[10,0,10,7],[33,0,33,7],[5,2,5,3],[5,4,5,5],[5,6,5,7],[6,2,6,3],[6,4,6,5],[6,6,6,7],[4,2,4,3],[4,4,4,5],[4,6,4,7],[0,0,0,1],[1,0,1,3],[3,2,3,3],[3,4,3,5],[3,6,3,7]]}
["Retail Comparison Grid"]
["Enter data in the yellow cells only."]
[]
[null,"Subject","Comparable 1",null,"Comparable 2",null,"Comparable 3"]
["Property Name"]
["Base rental rate"]
["- Concessions"]
["+ Exp. pass-through"]
{"$rows_left_out":31}
{"sheet":"EF Cash Flow","index":11,"n_rows":183,"n_cols":20,"rows_kept":183,"cut":false,"hidden":true,"merged":[[0,8,0,15]]}
[null,null,null,null,null,null,null,null,"Amortization"]
[null,"Rent","Opex Stop","Actual Opex","Opex Impact","Tax Stop","Actual Tax","Tax Impact","TI","Comm.","Buy-out","Move","Space","Other1","Other2","Other3","Concess","Net"]
[0,null,null,null,null,null,null,null,null,null,null,null,null,null,null,null,{"$f":"-SUMIF(#REF!,A3,#REF!)/#REF!","v":{"$error":"#REF!"}},{"$f":"SUM(H3:Q3)+E3+B3","v":{"$error":"#REF!"}}]
[1,{"$f":"VLOOKUP(A4,#REF!,3)/12","v":{"$error":"#REF!"}},{"$f":"-#REF!/12","v":{"$error":"#REF!"}},{"$f":"-IF($A4>#REF!,0,(#REF!*(1+#REF!)^(INT((A4-1)/12)))/12)","v":{"$error":"#REF!"}},{"$f":"IF(D4>C4,D4,C4)","v":{"$error":"#REF!"}},{"$f":"-#REF!/12","v":{"$error":"#REF!"}},{"$f":"-IF($A4>#REF!,0,(#REF!*(1+#REF!)^(INT(($A4-1)/12)))/12)","v":{"$error":"#REF!"}},{"$f":"IF(G4>F4,G4,F4)","v":{"$error":"#REF!"}},{"$f":"IF(AND(A4>#REF!,A4<(#REF!+#REF!+1)),#REF!/#REF!,0)","v":{"$error":"#REF!"}},{"$f":"IF(AND($A4>#REF!,$A4<(#REF!+#REF!+1)),#REF!/#REF!,0)","v":{"$error":"#REF!"}},{"$f":"IF(AND($A4>#REF!,$A4<(#REF!+#REF!+1)),#REF!/#REF!,0)","v":{"$error":"#REF!"}},{"$f":"IF(AND($A4>#REF!,$A4<(#REF!+#REF!+1)),#REF!/#REF!,0)","v":{"$error":"#REF!"}},{"$f":"IF(AND($A4>#REF!,$A4<(#REF!+#REF!+1)),#REF!/#REF!,0)","v":{"$error":"#REF!"}},{"$f":"IF(AND($A4>#REF!,$A4<(#REF!+#REF!+1)),#REF!/#REF!,0)","v":{"$error":"#REF!"}},{"$f":"IF(AND($A4>#REF!,$A4<(#REF!+#REF!+1)),#REF!/#REF!,0)","v":{"$error":"#REF!"}},{"$f":"IF(AND($A4>#REF!,$A4<(#REF!+#REF!+1)),#REF!/#REF!,0)","v":{"$error":"#REF!"}},{"$f":"-SUMIF(#REF!,A4,#REF!)/#REF!","v":{"$error":"#REF!"}},{"$error":"#REF!"}]
[2,{"$f":"VLOOKUP(A5,#REF!,3)/12","v":{"$error":"#REF!"}},{"$f":"-#REF!/12","v":{"$error":"#REF!"}},{"$f":"-IF($A5>#REF!,0,(#REF!*(1+#REF!)^(INT((A5-1)/12)))/12)","v":{"$error":"#REF!"}},{"$error":"#REF!"},{"$f":"-#REF!/12","v":{"$error":"#REF!"}},{"$f":"-IF($A5>#REF!,0,(#REF!*(1+#REF!)^(INT(($A5-1)/12)))/12)","v":{"$error":"#REF!"}},{"$error":"#REF!"},{"$f":"IF(AND(A5>#REF!,A5<(#REF!+#REF!+1)),#REF!/#REF!,0)","v":{"$error":"#REF!"}},{"$f":"IF(AND($A5>#REF!,$A5<(#REF!+#REF!+1)),#REF!/#REF!,0)","v":{"$error":"#REF!"}},{"$f":"IF(AND($A5>#REF!,$A5<(#REF!+#REF!+1)),#REF!/#REF!,0)","v":{"$error":"#REF!"}},{"$f":"IF(AND($A5>#REF!,$A5<(#REF!+#REF!+1)),#REF!/#REF!,0)","v":{"$error":"#REF!"}},{"$f":"IF(AND($A5>#REF!,$A5<(#REF!+#REF!+1)),#REF!/#REF!,0)","v":{"$error":"#REF!"}},{"$f":"IF(AND($A5>#REF!,$A5<(#REF!+#REF!+1)),#REF!/#REF!,0)","v":{"$error":"#REF!"}},{"$f":"IF(AND($A5>#REF!,$A5<(#REF!+#REF!+1)),#REF!/#REF!,0)","v":{"$error":"#REF!"}},{"$f":"IF(AND($A5>#REF!,$A5<(#REF!+#REF!+1)),#REF!/#REF!,0)","v":{"$error":"#REF!"}},{"$f":"-SUMIF(#REF!,A5,#REF!)/#REF!","v":{"$error":"#REF!"}},{"$error":"#REF!"}]
[3,{"$f":"VLOOKUP(A6,#REF!,3)/12","v":{"$error":"#REF!"}},{"$f":"-#REF!/12","v":{"$error":"#REF!"}},{"$f":"-IF($A6>#REF!,0,(#REF!*(1+#REF!)^(INT((A6-1)/12)))/12)","v":{"$error":"#REF!"}},{"$error":"#REF!"},{"$f":"-#REF!/12","v":{"$error":"#REF!"}},{"$f":"-IF($A6>#REF!,0,(#REF!*(1+#REF!)^(INT(($A6-1)/12)))/12)","v":{"$error":"#REF!"}},{"$error":"#REF!"},{"$f":"IF(AND(A6>#REF!,A6<(#REF!+#REF!+1)),#REF!/#REF!,0)","v":{"$error":"#REF!"}},{"$f":"IF(AND($A6>#REF!,$A6<(#REF!+#REF!+1)),#REF!/#REF!,0)","v":{"$error":"#REF!"}},{"$f":"IF(AND($A6>#REF!,$A6<(#REF!+#REF!+1)),#REF!/#REF!,0)","v":{"$error":"#REF!"}},{"$f":"IF(AND($A6>#REF!,$A6<(#REF!+#REF!+1)),#REF!/#REF!,0)","v":{"$error":"#REF!"}},{"$f":"IF(AND($A6>#REF!,$A6<(#REF!+#REF!+1)),#REF!/#REF!,0)","v":{"$error":"#REF!"}},{"$f":"IF(AND($A6>#REF!,$A6<(#REF!+#REF!+1)),#REF!/#REF!,0)","v":{"$error":"#REF!"}},{"$f":"IF(AND($A6>#REF!,$A6<(#REF!+#REF!+1)),#REF!/#REF!,0)","v":{"$error":"#REF!"}},{"$f":"IF(AND($A6>#REF!,$A6<(#REF!+#REF!+1)),#REF!/#REF!,0)","v":{"$error":"#REF!"}},{"$f":"-SUMIF(#REF!,A6,#REF!)/#REF!","v":{"$error":"#REF!"}},{"$error":"#REF!"},null,"Instructions: This sheet automatically calcuates the results to the Effective Rent tab."]
[4,{"$f":"VLOOKUP(A7,#REF!,3)/12","v":{"$error":"#REF!"}},{"$f":"-#REF!/12","v":{"$error":"#REF!"}},{"$f":"-IF($A7>#REF!,0,(#REF!*(1+#REF!)^(INT((A7-1)/12)))/12)","v":{"$error":"#REF!"}},{"$error":"#REF!"},{"$f":"-#REF!/12","v":{"$error":"#REF!"}},{"$f":"-IF($A7>#REF!,0,(#REF!*(1+#REF!)^(INT(($A7-1)/12)))/12)","v":{"$error":"#REF!"}},{"$error":"#REF!"},{"$f":"IF(AND(A7>#REF!,A7<(#REF!+#REF!+1)),#REF!/#REF!,0)","v":{"$error":"#REF!"}},{"$f":"IF(AND($A7>#REF!,$A7<(#REF!+#REF!+1)),#REF!/#REF!,0)","v":{"$error":"#REF!"}},{"$f":"IF(AND($A7>#REF!,$A7<(#REF!+#REF!+1)),#REF!/#REF!,0)","v":{"$error":"#REF!"}},{"$f":"IF(AND($A7>#REF!,$A7<(#REF!+#REF!+1)),#REF!/#REF!,0)","v":{"$error":"#REF!"}},{"$f":"IF(AND($A7>#REF!,$A7<(#REF!+#REF!+1)),#REF!/#REF!,0)","v":{"$error":"#REF!"}},{"$f":"IF(AND($A7>#REF!,$A7<(#REF!+#REF!+1)),#REF!/#REF!,0)","v":{"$error":"#REF!"}},{"$f":"IF(AND($A7>#REF!,$A7<(#REF!+#REF!+1)),#REF!/#REF!,0)","v":{"$error":"#REF!"}},{"$f":"IF(AND($A7>#REF!,$A7<(#REF!+#REF!+1)),#REF!/#REF!,0)","v":{"$error":"#REF!"}},{"$f":"-SUMIF(#REF!,A7,#REF!)/#REF!","v":{"$error":"#REF!"}},{"$error":"#REF!"}]
[5,{"$f":"VLOOKUP(A8,#REF!,3)/12","v":{"$error":"#REF!"}},{"$f":"-#REF!/12","v":{"$error":"#REF!"}},{"$f":"-IF($A8>#REF!,0,(#REF!*(1+#REF!)^(INT((A8-1)/12)))/12)","v":{"$error":"#REF!"}},{"$error":"#REF!"},{"$f":"-#REF!/12","v":{"$error":"#REF!"}},{"$f":"-IF($A8>#REF!,0,(#REF!*(1+#REF!)^(INT(($A8-1)/12)))/12)","v":{"$error":"#REF!"}},{"$error":"#REF!"},{"$f":"IF(AND(A8>#REF!,A8<(#REF!+#REF!+1)),#REF!/#REF!,0)","v":{"$error":"#REF!"}},{"$f":"IF(AND($A8>#REF!,$A8<(#REF!+#REF!+1)),#REF!/#REF!,0)","v":{"$error":"#REF!"}},{"$f":"IF(AND($A8>#REF!,$A8<(#REF!+#REF!+1)),#REF!/#REF!,0)","v":{"$error":"#REF!"}},{"$f":"IF(AND($A8>#REF!,$A8<(#REF!+#REF!+1)),#REF!/#REF!,0)","v":{"$error":"#REF!"}},{"$f":"IF(AND($A8>#REF!,$A8<(#REF!+#REF!+1)),#REF!/#REF!,0)","v":{"$error":"#REF!"}},{"$f":"IF(AND($A8>#REF!,$A8<(#REF!+#REF!+1)),#REF!/#REF!,0)","v":{"$error":"#REF!"}},{"$f":"IF(AND($A8>#REF!,$A8<(#REF!+#REF!+1)),#REF!/#REF!,0)","v":{"$error":"#REF!"}},{"$f":"IF(AND($A8>#REF!,$A8<(#REF!+#REF!+1)),#REF!/#REF!,0)","v":{"$error":"#REF!"}},{"$f":"-SUMIF(#REF!,A8,#REF!)/#REF!","v":{"$error":"#REF!"}},{"$error":"#REF!"}]
{"$rows_left_out":176}
{"sheet":"Alt Retail Comp Grid 2","index":12,"n_rows":38,"n_cols":8,"rows_kept":38,"cut":false,"hidden":false,"merged":[[37,0,37,5],[35,2,35,3],[35,4,35,5],[35,6,35,7],[36,2,36,3],[36,4,36,5],[36,6,36,7],[34,2,34,3],[34,4,34,5],[34,6,34,7],[7,2,7,3],[7,4,7,5],[7,6,7,7],[8,2,8,3],[8,4,8,5],[8,6,8,7],[9,2,9,3],[9,4,9,5],[9,6,9,7],[10,0,10,7],[33,0,33,7],[5,2,5,3],[5,4,5,5],[5,6,5,7],[6,2,6,3],[6,4,6,5],[6,6,6,7],[4,2,4,3],[4,4,4,5],[4,6,4,7],[0,0,0,1],[1,0,1,3],[3,2,3,3],[3,4,3,5],[3,6,3,7]]}
["Retail Comparison Grid"]
["Enter data in the yellow cells only."]
[]
[null,"Subject","Comparable 1",null,"Comparable 2",null,"Comparable 3"]
["Property Name"]
["Base rental rate"]
["- Concessions"]
["+ Exp. pass-through"]
{"$rows_left_out":31}
{"sheet":"As-Is BTCF T Bars","index":13,"n_rows":36,"n_cols":7,"rows_kept":36,"cut":false,"hidden":false,"merged":[[0,0,0,4],[4,1,4,2],[11,1,11,2],[47,1,47,2],[19,1,19,2],[28,1,28,2],[37,1,37,2]]}
["As Is Before-Tax Cash Flow T-Bars"]
["This tab automatically calculates figures based on data entered in other tabs."]
[]
[null,null,null,"Final Cash Flow","NSP"]
[null," 2 Year T-BAR"]
[null,"N","$"]
[null," Current Equity",{"$f":"-'As-Is Before-Tax Cash Flow'!$B$29","v":0}]
[null,"BTCF Year 1",{"$f":"+'As-Is Before-Tax Cash Flow'!$F$9","v":-1.0050087499825811E-9}]
{"$rows_left_out":29}
{"sheet":"As-Is Loan Amortization","index":14,"n_rows":74,"n_cols":6,"rows_kept":74,"cut":false,"hidden":false,"merged":[[5,0,5,1],[0,0,0,2],[1,0,1,5],[3,0,3,1],[4,0,4,1]]}
["As Is Loan Amortization"]
["This tab automatically calculates figures based on data entered in other tabs."]
[]
["Loan Amount",null,{"$f":"IF('As-Is Owner Goals'!C4<=0,0.000001,+'As-Is Before-Tax Cash Flow'!C4)","v":9.9999999999999995E-7}]
["Loan Interest Rate",null,{"$f":"IF('As-Is Owner Goals'!C5<=0,0.00001,+'As-Is Owner Goals'!C5)","v":1.0000000000000001E-5},"Number of Months",{"$f":"+C6*12","v":12000}]
["Loan Amortization Period",null,{"$f":"IF('As-Is Owner Goals'!C7<=0,1000,+'As-Is Owner Goals'!C7)","v":1000},"Rate per Month",{"$f":"IF('As-Is Owner Goals'!C14=\"Monthly\",C5/12,((1+C5/2)^(2/12)-1))","v":8.3333333333333344E-7}]
[]
[{"$f":"IF(A10<=0,1,+A10-1)","v":0},{"$f":"PMT($E$6,$E$5,$C$4,0,0)","v":-8.3750729165215093E-11},{"$f":"IF(A8<=1,0,PPMT($E$6,$A8,$E$5,$C$4))","v":0},{"$f":"IF(A8<=1,0,IPMT($E$6,$A8,$E$5,$C$4))","v":0}," ",{"$f":"IF(OR(SUM($E$5-$A10)=0,SUM($E$5-$A10)>0),-FV($E$6,$A8,$B8,$C$4,0),0)","v":9.9999999999999995E-7}]
{"$rows_left_out":67}
{"sheet":"Alt BTCF T Bars","index":15,"n_rows":36,"n_cols":7,"rows_kept":36,"cut":false,"hidden":false,"merged":[[0,0,0,4],[4,1,4,2],[11,1,11,2],[47,1,47,2],[19,1,19,2],[28,1,28,2],[37,1,37,2]]}
["Alternative Before-Tax Cash Flow T-Bars"]
["This tab automatically calculates figures based on data entered in other tabs."]
[]
[null,null,null,"Final Cash Flow","NSP"]
[null," 2 Year T-BAR"]
[null,"N","$"]
[null," Current Equity",{"$f":"-'Alt Before-Tax Cash Flow'!$B$29","v":0}]
[null,"BTCF Year 1",{"$f":"+'Alt Before-Tax Cash Flow'!$F$9","v":-1.0050087499825811E-9}]
{"$rows_left_out":29}
{"sheet":"Alt Loan Amortization","index":16,"n_rows":74,"n_cols":6,"rows_kept":74,"cut":false,"hidden":false,"merged":[[5,0,5,1],[0,0,0,2],[1,0,1,5],[3,0,3,1],[4,0,4,1]]}
["Alternative Loan Amortization"]
["This tab automatically calculates figures based on data entered in other tabs."]
[]
["Loan Amount",null,{"$f":"IF('Alt Owner Goals'!C4<=0,0.000001,+'Alt Before-Tax Cash Flow'!C4)","v":9.9999999999999995E-7}]
["Loan Interest Rate",null,{"$f":"IF('Alt Owner Goals'!C5<=0,0.00001,+'Alt Owner Goals'!C5)","v":1.0000000000000001E-5},"Number of Months",{"$f":"+C6*12","v":12000}]
["Loan Amortization Period",null,{"$f":"IF('Alt Owner Goals'!C7<=0,1000,+'Alt Owner Goals'!C7)","v":1000},"Rate per Month",{"$f":"IF('Alt Owner Goals'!C14=\"Monthly\",C5/12,((1+C5/2)^(2/12)-1))","v":8.3333333333333344E-7}]
[]
[{"$f":"IF(A10<=0,1,+A10-1)","v":0},{"$f":"PMT($E$6,$E$5,$C$4,0,0)","v":-8.3750729165215093E-11},{"$f":"IF(A8<=1,0,PPMT($E$6,$A8,$E$5,$C$4))","v":0},{"$f":"IF(A8<=1,0,IPMT($E$6,$A8,$E$5,$C$4))","v":0}," ",{"$f":"IF(OR(SUM($E$5-$A10)=0,SUM($E$5-$A10)>0),-FV($E$6,$A8,$B8,$C$4,0),0)","v":9.9999999999999995E-7}]
{"$rows_left_out":67}
{"sheet":"Calculator","index":17,"n_rows":69,"n_cols":10,"rows_kept":69,"cut":false,"hidden":false,"merged":[[66,1,67,1],[66,3,67,3],[66,5,67,5],[66,7,67,7],[66,9,67,9],[54,1,55,10],[1,0,1,14],[7,1,8,1],[7,3,8,3],[7,5,8,5],[7,7,8,7],[7,9,8,9],[10,1,11,1],[10,3,11,3],[14,1,15,1],[14,7,17,7],[23,3,23,9]]}
["Basic Math and Time Value of Money (TVM) Calculations"]
["Enter data in the yellow cells only. Press BOLD function button to perform TVM calculation."]
["Please note: The Mac OS does not support visual basic macros. Therefore, the buttons on this tab will not function in the Mac environment."]
[]
[]
[]
[null,"N",null,"Interest (I/YR)",null,"Present Value (PV)",null,"Payment (PMT)",null,"Future Value (FV)"]
[]
{"$rows_left_out":62}
{"sheet":"Blank Sheet for Calculations","index":18,"n_rows":0,"n_cols":0,"rows_kept":0,"cut":false,"hidden":false,"merged":[]}